firemail
标题:
with-l10n-base设置的路径找不到
[打印本页]
作者:
Qter
时间:
2020-8-7 09:43
标题:
with-l10n-base设置的路径找不到
ac_add_options --with-l10n-base=$topsrcdir/comm/mail/locales
复制代码
144:36.97 lld-link: warning: ignoring unknown argument '-RELEASE'
144:37.10 Embedding manifest from ../../../../js/xpconnect/shell/xpcshell.exe.manifest
144:37.11 Embedding manifest from ../../../ipc/app/plugin-container.exe.manifest
144:37.22 toolkit/library/dummydll/module.res
144:37.23 Creating Resource file: module.res
144:37.27 toolkit/library/dummydll/qipcap64.dll
144:37.27 lld-link: warning: ignoring unknown argument '-RELEASE'
144:51.71 Traceback (most recent call last):
144:51.71 File "c:\mozilla-build\python3\Lib\runpy.py", line 193, in _run_module_as_main
144:51.71 "__main__", mod_spec)
144:51.71 File "c:\mozilla-build\python3\Lib\runpy.py", line 85, in _run_code
144:51.71 exec(code, run_globals)
144:51.71 File "f:\Thunderbird_build\source\python\mozbuild\mozbuild\action\jar_maker.py", line 17, in <module>
144:51.71 sys.exit(main(sys.argv[1:]))
144:51.71 File "f:\Thunderbird_build\source\python\mozbuild\mozbuild\action\jar_maker.py", line 13, in main
144:51.71 return mozbuild.jar.main(args)
144:51.71 File "f:\Thunderbird_build\source\python\mozbuild\mozbuild\jar.py", line 603, in main
144:51.72 jm.makeJar(infile, options.d)
144:51.72 File "f:\Thunderbird_build\source\python\mozbuild\mozbuild\jar.py", line 332, in makeJar
144:51.72 self.processJarSection(info, jardir)
144:51.72 File "f:\Thunderbird_build\source\python\mozbuild\mozbuild\jar.py", line 385, in processJarSection
144:51.72 self._processEntryLine(e, outHelper, jf)
144:51.72 File "f:\Thunderbird_build\source\python\mozbuild\mozbuild\jar.py", line 406, in _processEntryLine
144:51.72 len(self.localedirs) > 1 and
144:51.72 TypeError: object of type 'NoneType' has no len()
144:51.74 mozmake.EXE[4]: *** [f:/Thunderbird_build/source/config/rules.mk;940: misc] Error 1
144:51.74 mozmake.EXE[3]: *** [f:/Thunderbird_build/source/config/recurse.mk;99: comm/calendar/locales/misc] Error 2
144:51.74 mozmake.EXE[3]: *** Waiting for unfinished jobs....
144:52.03 mozmake.EXE[2]: *** [f:/Thunderbird_build/source/config/recurse.mk;34: misc] Error 2
144:52.05 mozmake.EXE[1]: *** [f:/Thunderbird_build/source/config/rules.mk;390: default] Error 2
144:52.07 mozmake.EXE: *** [client.mk;125: build] Error 2
144:52.12 256 compiler warnings present.
复制代码
欢迎光临 firemail (http://firemail.wang:8088/)
Powered by Discuz! X3